*Heading
** Job name: Ex-2-3 Model name: Model-1
** Generated by: Abaqus/CAE Student Edition 6.10-2
*Preprint, echo=NO, model=NO, history=NO, contact=NO
**
** PARTS
**
*Part, name=Fig_2_7
*Node
*Element, type=CPS4R
*Nset, nset=_PickedSet2, internal, generate
*Elset, elset=_PickedSet2, internal, generate
** Section: Section-1
*Solid Section, elset=_PickedSet2, material=Material-1
4.,
*End Part
**
**
** ASSEMBLY
**
*Assembly, name=Assembly
**
*Instance, name=Fig_2_7-1, part=Fig_2_7
*End Instance
**
*Nset, nset=_PickedSet9, internal, instance=Fig_2_7-1, generate
*Elset, elset=_PickedSet9, internal, instance=Fig_2_7-1, generate
*Elset, elset=__PickedSurf8_S3, internal, instance=Fig_2_7-1, generate
*Surface, type=ELEMENT, name=_PickedSurf8, internal
__PickedSurf8_S3, S3
*End Assembly
**
** MATERIALS
**
*Material, name=Material-1
*Elastic
195000., 0.3
** ----------------------------------------------------------------
**
** STEP: Step-1
**
*Step, name=Step-1
*Static
1., 1., 1e-05, 1.
**
** BOUNDARY CONDITIONS
**
** Name: BC-1 Type: Displacement/Rotation
*Boundary
_PickedSet9, 1, 1
_PickedSet9, 2, 2
_PickedSet9, 6, 6
**
** LOADS
**
** Name: Load-1   Type: Pressure
*Dsload
_PickedSurf8, P, -9.5
**
** OUTPUT REQUESTS
**
*Restart, write, frequency=0
**
** FIELD OUTPUT: F-Output-1
**
*Output, field, variable=PRESELECT
**
** HISTORY OUTPUT: H-Output-1
**
*Output, history, variable=PRESELECT
*End Step