*Heading
Example 2.2 FEA of Composite Materials: using Abaqus
*Part, name=Part1
*Node
*Element, type=CPS4R
*Nset, nset=NamedSet, generate
*Elset, elset=NamedSet, generate
** Section: Section-1
*Solid Section, elset=NamedSet, material=Material-1
4.,
*End Part
*Assembly, name=Assembly
*Instance, name=Part1-1, part=Part1
*End Instance
*Nset, nset=Nodeset1, internal, instance=Part1-1
*Nset, nset=Nodeset2, internal, instance=Part1-1
*Elset, elset=Elset1, internal, instance=Part1-1
*Surface, type=ELEMENT, name=Surface1, internal
Elset1, S2
*End Assembly
*Material, name=Material-1
*Elastic
195000., 0.3
*Step, name=Step-1
*Static
1., 1., 1e-05, 1.
*Boundary
Nodeset1, 1, 2
Nodeset2, 1, 1
*Dsload
Surface1, P, -9.5
*Restart, write, frequency=0
*Output, field, variable=PRESELECT
*Output, history, variable=PRESELECT
*End Step