*Heading
** Job name: Job-1 Model name: Model-1
** Generated by: Abaqus/CAE 2020
*Preprint, echo=NO, model=NO, history=NO, contact=NO
**
** PARTS
**
*Part, name=Part-1
*Node
*Element, type=CPS3
*Element, type=CPE4
*Node
*Nset, nset=Part-1-RefPt_, internal
*Nset, nset=_PickedSet3, internal
*Elset, elset=_PickedSet3, internal
*Nset, nset=_PickedSet4, internal
*Elset, elset=_PickedSet4, internal
*Nset, nset=Face1
*Elset, elset=Face1
*Nset, nset=Face2
*Elset, elset=Face2
*Nset, nset=Face3
*Elset, elset=Face3
*Nset, nset=Face4
*Elset, elset=Face4
*Nset, nset=Vertex1
*Nset, nset=Vertex2
*Nset, nset=Vertex3
*Nset, nset=Vertex4
*Nset, nset=MasterNode
*Nset, nset=MasterFace13-0
*Nset, nset=SlaveFace13-0
*Nset, nset=MasterFace13-1
*Nset, nset=SlaveFace13-1
*Nset, nset=MasterFace13-2
*Nset, nset=SlaveFace13-2
*Nset, nset=MasterFace13-3
*Nset, nset=SlaveFace13-3
*Nset, nset=MasterFace13-4
*Nset, nset=SlaveFace13-4
*Nset, nset=MasterFace13-5
*Nset, nset=SlaveFace13-5
*Nset, nset=MasterFace13-6
*Nset, nset=SlaveFace13-6
*Nset, nset=MasterFace13-7
*Nset, nset=SlaveFace13-7
*Nset, nset=MasterFace13-8
*Nset, nset=SlaveFace13-8
*Nset, nset=MasterFace13-9
*Nset, nset=SlaveFace13-9
*Nset, nset=MasterFace13-10
*Nset, nset=SlaveFace13-10
*Nset, nset=MasterFace13-11
*Nset, nset=SlaveFace13-11
*Nset, nset=MasterFace13-12
*Nset, nset=SlaveFace13-12
*Nset, nset=MasterFace13-13
*Nset, nset=SlaveFace13-13
*Nset, nset=MasterFace13-14
*Nset, nset=SlaveFace13-14
*Nset, nset=MasterFace13-15
*Nset, nset=SlaveFace13-15
*Nset, nset=MasterFace13-16
*Nset, nset=SlaveFace13-16
*Nset, nset=MasterFace13-17
*Nset, nset=SlaveFace13-17
*Nset, nset=MasterFace13-18
*Nset, nset=SlaveFace13-18
*Nset, nset=MasterFace13-19
*Nset, nset=SlaveFace13-19
** ... 100 like lines cut
** Section: fiber-sec
*Solid Section, elset=_PickedSet3, material=fiber
** Section: matrix-sec
*Solid Section, elset=_PickedSet4, material=matrix
*End Part
**
**
** ASSEMBLY
**
*Assembly, name=Assembly
**
*Instance, name=Part-1-1, part=Part-1
*End Instance
**
*Nset, nset=_PickedSet4, internal, instance=Part-1-1
** Constraint: Constraint13-1-0
*Equation
Part-1-1.MasterFace13-0, 1, 1.
Part-1-1.SlaveFace13-0, 1, -1.
Part-1-1.MasterNode, 1, -0.
** Constraint: Constraint13-1-1
*Equation
Part-1-1.MasterFace13-1, 1, 1.
Part-1-1.SlaveFace13-1, 1, -1.
Part-1-1.MasterNode, 1, -0.
** Constraint: Constraint13-1-2
*Equation
Part-1-1.MasterFace13-2, 1, 1.
Part-1-1.SlaveFace13-2, 1, -1.
Part-1-1.MasterNode, 1, -0.
** Constraint: Constraint13-1-3
*Equation
Part-1-1.MasterFace13-3, 1, 1.
Part-1-1.SlaveFace13-3, 1, -1.
Part-1-1.MasterNode, 1, -0.
** Constraint: Constraint13-1-4
*Equation
Part-1-1.MasterFace13-4, 1, 1.
Part-1-1.SlaveFace13-4, 1, -1.
Part-1-1.MasterNode, 1, -0.
** Constraint: Constraint13-1-5
*Equation
Part-1-1.MasterFace13-5, 1, 1.
Part-1-1.SlaveFace13-5, 1, -1.
Part-1-1.MasterNode, 1, -0.
** Constraint: Constraint13-1-6
*Equation
Part-1-1.MasterFace13-6, 1, 1.
Part-1-1.SlaveFace13-6, 1, -1.
Part-1-1.MasterNode, 1, -0.
** Constraint: Constraint13-1-7
*Equation
Part-1-1.MasterFace13-7, 1, 1.
Part-1-1.SlaveFace13-7, 1, -1.
Part-1-1.MasterNode, 1, -0.
** Constraint: Constraint13-1-8
*Equation
Part-1-1.MasterFace13-8, 1, 1.
Part-1-1.SlaveFace13-8, 1, -1.
Part-1-1.MasterNode, 1, -0.
** Constraint: Constraint13-1-9
*Equation
Part-1-1.MasterFace13-9, 1, 1.
Part-1-1.SlaveFace13-9, 1, -1.
Part-1-1.MasterNode, 1, -0.
** Constraint: Constraint13-1-10
*Equation
Part-1-1.MasterFace13-10, 1, 1.
Part-1-1.SlaveFace13-10, 1, -1.
Part-1-1.MasterNode, 1, -0.
** Constraint: Constraint13-1-11
*Equation
Part-1-1.MasterFace13-11, 1, 1.
Part-1-1.SlaveFace13-11, 1, -1.
Part-1-1.MasterNode, 1, -0.
** Constraint: Constraint13-1-12
*Equation
Part-1-1.MasterFace13-12, 1, 1.
Part-1-1.SlaveFace13-12, 1, -1.
Part-1-1.MasterNode, 1, -0.
** Constraint: Constraint13-1-13
*Equation
Part-1-1.MasterFace13-13, 1, 1.
Part-1-1.SlaveFace13-13, 1, -1.
Part-1-1.MasterNode, 1, -0.
** Constraint: Constraint13-1-14
*Equation
Part-1-1.MasterFace13-14, 1, 1.
Part-1-1.SlaveFace13-14, 1, -1.
Part-1-1.MasterNode, 1, -0.
** Constraint: Constraint13-1-15
*Equation
Part-1-1.MasterFace13-15, 1, 1.
Part-1-1.SlaveFace13-15, 1, -1.
Part-1-1.MasterNode, 1, -0.
** Constraint: Constraint13-1-16
*Equation
Part-1-1.MasterFace13-16, 1, 1.
Part-1-1.SlaveFace13-16, 1, -1.
Part-1-1.MasterNode, 1, -0.
** Constraint: Constraint13-1-17
*Equation
Part-1-1.MasterFace13-17, 1, 1.
Part-1-1.SlaveFace13-17, 1, -1.
Part-1-1.MasterNode, 1, -0.
** Constraint: Constraint13-1-18
*Equation
Part-1-1.MasterFace13-18, 1, 1.
Part-1-1.SlaveFace13-18, 1, -1.
Part-1-1.MasterNode, 1, -0.
** Constraint: Constraint13-1-19
*Equation
Part-1-1.MasterFace13-19, 1, 1.
Part-1-1.SlaveFace13-19, 1, -1.
Part-1-1.MasterNode, 1, -0.
** Constraint: Constraint13-1-20
*Equation
Part-1-1.MasterFace13-20, 1, 1.
Part-1-1.SlaveFace13-20, 1, -1.
Part-1-1.MasterNode, 1, -0.
** Constraint: Constraint13-1-21
*Equation
Part-1-1.MasterFace13-21, 1, 1.
Part-1-1.SlaveFace13-21, 1, -1.
Part-1-1.MasterNode, 1, -0.
** Constraint: Constraint13-1-22
*Equation
Part-1-1.MasterFace13-22, 1, 1.
Part-1-1.SlaveFace13-22, 1, -1.
Part-1-1.MasterNode, 1, -0.
** Constraint: Constraint13-1-23
*Equation
Part-1-1.MasterFace13-23, 1, 1.
Part-1-1.SlaveFace13-23, 1, -1.
Part-1-1.MasterNode, 1, -0.
** Constraint: Constraint13-1-24
*Equation
Part-1-1.MasterFace13-24, 1, 1.
Part-1-1.SlaveFace13-24, 1, -1.
Part-1-1.MasterNode, 1, -0.
** Constraint: Constraint13-1-25
*Equation
Part-1-1.MasterFace13-25, 1, 1.
Part-1-1.SlaveFace13-25, 1, -1.
Part-1-1.MasterNode, 1, -0.
** Constraint: Constraint13-1-26
*Equation
Part-1-1.MasterFace13-26, 1, 1.
Part-1-1.SlaveFace13-26, 1, -1.
Part-1-1.MasterNode, 1, -0.
** Constraint: Constraint13-1-27
*Equation
Part-1-1.MasterFace13-27, 1, 1.
Part-1-1.SlaveFace13-27, 1, -1.
Part-1-1.MasterNode, 1, -0.
** Constraint: Constraint13-1-28
*Equation
Part-1-1.MasterFace13-28, 1, 1.
Part-1-1.SlaveFace13-28, 1, -1.
Part-1-1.MasterNode, 1, -0.
** Constraint: Constraint13-1-29
*Equation
Part-1-1.MasterFace13-29, 1, 1.
Part-1-1.SlaveFace13-29, 1, -1.
Part-1-1.MasterNode, 1, -0.
** Constraint: Constraint13-1-30
*Equation
Part-1-1.MasterFace13-30, 1, 1.
Part-1-1.SlaveFace13-30, 1, -1.
Part-1-1.MasterNode, 1, -0.
** Constraint: Constraint13-1-31
*Equation
Part-1-1.MasterFace13-31, 1, 1.
Part-1-1.SlaveFace13-31, 1, -1.
Part-1-1.MasterNode, 1, -0.
** Constraint: Constraint13-1-32
*Equation
Part-1-1.MasterFace13-32, 1, 1.
Part-1-1.SlaveFace13-32, 1, -1.
Part-1-1.MasterNode, 1, -0.
** Constraint: Constraint13-1-33
*Equation
Part-1-1.MasterFace13-33, 1, 1.
Part-1-1.SlaveFace13-33, 1, -1.
Part-1-1.MasterNode, 1, -0.
** Constraint: Constraint13-1-34
*Equation
Part-1-1.MasterFace13-34, 1, 1.
Part-1-1.SlaveFace13-34, 1, -1.
Part-1-1.MasterNode, 1, -0.
** Constraint: Constraint13-1-35
*Equation
Part-1-1.MasterFace13-35, 1, 1.
Part-1-1.SlaveFace13-35, 1, -1.
Part-1-1.MasterNode, 1, -0.
** Constraint: Constraint13-1-36
*Equation
Part-1-1.MasterFace13-36, 1, 1.
Part-1-1.SlaveFace13-36, 1, -1.
Part-1-1.MasterNode, 1, -0.
** Constraint: Constraint13-1-37
*Equation
Part-1-1.MasterFace13-37, 1, 1.
Part-1-1.SlaveFace13-37, 1, -1.
Part-1-1.MasterNode, 1, -0.
** Constraint: Constraint13-1-38
*Equation
Part-1-1.MasterFace13-38, 1, 1.
Part-1-1.SlaveFace13-38, 1, -1.
Part-1-1.MasterNode, 1, -0.
** Constraint: Constraint13-1-39
*Equation
Part-1-1.MasterFace13-39, 1, 1.
Part-1-1.SlaveFace13-39, 1, -1.
Part-1-1.MasterNode, 1, -0.
** Constraint: Constraint13-1-40
*Equation
Part-1-1.MasterFace13-40, 1, 1.
Part-1-1.SlaveFace13-40, 1, -1.
Part-1-1.MasterNode, 1, -0.
** Constraint: Constraint13-1-41
*Equation
Part-1-1.MasterFace13-41, 1, 1.
Part-1-1.SlaveFace13-41, 1, -1.
Part-1-1.MasterNode, 1, -0.
** Constraint: Constraint13-1-42
*Equation
Part-1-1.MasterFace13-42, 1, 1.
Part-1-1.SlaveFace13-42, 1, -1.
Part-1-1.MasterNode, 1, -0.
** Constraint: Constraint13-1-43
*Equation
Part-1-1.MasterFace13-43, 1, 1.
Part-1-1.SlaveFace13-43, 1, -1.
Part-1-1.MasterNode, 1, -0.
** Constraint: Constraint13-1-44
*Equation
Part-1-1.MasterFace13-44, 1, 1.
Part-1-1.SlaveFace13-44, 1, -1.
Part-1-1.MasterNode, 1, -0.
** Constraint: Constraint13-2-0
*Equation
Part-1-1.MasterFace13-0, 2, 1.
Part-1-1.SlaveFace13-0, 2, -1.
Part-1-1.MasterNode, 1, -0.1054
** Constraint: Constraint13-2-1
*Equation
Part-1-1.MasterFace13-1, 2, 1.
Part-1-1.SlaveFace13-1, 2, -1.
Part-1-1.MasterNode, 1, -0.1054
** Constraint: Constraint13-2-2
*Equation
Part-1-1.MasterFace13-2, 2, 1.
Part-1-1.SlaveFace13-2, 2, -1.
Part-1-1.MasterNode, 1, -0.1054
** Constraint: Constraint13-2-3
*Equation
Part-1-1.MasterFace13-3, 2, 1.
Part-1-1.SlaveFace13-3, 2, -1.
Part-1-1.MasterNode, 1, -0.1054
** Constraint: Constraint13-2-4
*Equation
Part-1-1.MasterFace13-4, 2, 1.
Part-1-1.SlaveFace13-4, 2, -1.
Part-1-1.MasterNode, 1, -0.1054
** Constraint: Constraint13-2-5
*Equation
Part-1-1.MasterFace13-5, 2, 1.
Part-1-1.SlaveFace13-5, 2, -1.
Part-1-1.MasterNode, 1, -0.1054
** Constraint: Constraint13-2-6
*Equation
Part-1-1.MasterFace13-6, 2, 1.
Part-1-1.SlaveFace13-6, 2, -1.
Part-1-1.MasterNode, 1, -0.1054
** Constraint: Constraint13-2-7
*Equation
Part-1-1.MasterFace13-7, 2, 1.
Part-1-1.SlaveFace13-7, 2, -1.
Part-1-1.MasterNode, 1, -0.1054
** Constraint: Constraint13-2-8
*Equation
Part-1-1.MasterFace13-8, 2, 1.
Part-1-1.SlaveFace13-8, 2, -1.
Part-1-1.MasterNode, 1, -0.1054
** Constraint: Constraint13-2-9
*Equation
Part-1-1.MasterFace13-9, 2, 1.
Part-1-1.SlaveFace13-9, 2, -1.
Part-1-1.MasterNode, 1, -0.1054
** Constraint: Constraint13-2-10
*Equation
Part-1-1.MasterFace13-10, 2, 1.
Part-1-1.SlaveFace13-10, 2, -1.
Part-1-1.MasterNode, 1, -0.1054
** Constraint: Constraint13-2-11
*Equation
Part-1-1.MasterFace13-11, 2, 1.
Part-1-1.SlaveFace13-11, 2, -1.
Part-1-1.MasterNode, 1, -0.1054
** Constraint: Constraint13-2-12
*Equation
Part-1-1.MasterFace13-12, 2, 1.
Part-1-1.SlaveFace13-12, 2, -1.
Part-1-1.MasterNode, 1, -0.1054
** Constraint: Constraint13-2-13
*Equation
Part-1-1.MasterFace13-13, 2, 1.
Part-1-1.SlaveFace13-13, 2, -1.
Part-1-1.MasterNode, 1, -0.1054
** Constraint: Constraint13-2-14
*Equation
Part-1-1.MasterFace13-14, 2, 1.
Part-1-1.SlaveFace13-14, 2, -1.
Part-1-1.MasterNode, 1, -0.1054
** Constraint: Constraint13-2-15
*Equation
Part-1-1.MasterFace13-15, 2, 1.
Part-1-1.SlaveFace13-15, 2, -1.
Part-1-1.MasterNode, 1, -0.1054
** Constraint: Constraint13-2-16
*Equation
Part-1-1.MasterFace13-16, 2, 1.
Part-1-1.SlaveFace13-16, 2, -1.
Part-1-1.MasterNode, 1, -0.1054
** Constraint: Constraint13-2-17
*Equation
Part-1-1.MasterFace13-17, 2, 1.
Part-1-1.SlaveFace13-17, 2, -1.
Part-1-1.MasterNode, 1, -0.1054
** Constraint: Constraint13-2-18
*Equation
Part-1-1.MasterFace13-18, 2, 1.
Part-1-1.SlaveFace13-18, 2, -1.
Part-1-1.MasterNode, 1, -0.1054
** Constraint: Constraint13-2-19
*Equation
Part-1-1.MasterFace13-19, 2, 1.
Part-1-1.SlaveFace13-19, 2, -1.
Part-1-1.MasterNode, 1, -0.1054
** Constraint: Constraint13-2-20
*Equation
Part-1-1.MasterFace13-20, 2, 1.
Part-1-1.SlaveFace13-20, 2, -1.
Part-1-1.MasterNode, 1, -0.1054
** Constraint: Constraint13-2-21
*Equation
Part-1-1.MasterFace13-21, 2, 1.
Part-1-1.SlaveFace13-21, 2, -1.
Part-1-1.MasterNode, 1, -0.1054
** Constraint: Constraint13-2-22
*Equation
Part-1-1.MasterFace13-22, 2, 1.
Part-1-1.SlaveFace13-22, 2, -1.
Part-1-1.MasterNode, 1, -0.1054
** Constraint: Constraint13-2-23
*Equation
Part-1-1.MasterFace13-23, 2, 1.
Part-1-1.SlaveFace13-23, 2, -1.
Part-1-1.MasterNode, 1, -0.1054
** Constraint: Constraint13-2-24
*Equation
Part-1-1.MasterFace13-24, 2, 1.
Part-1-1.SlaveFace13-24, 2, -1.
Part-1-1.MasterNode, 1, -0.1054
** Constraint: Constraint13-2-25
*Equation
Part-1-1.MasterFace13-25, 2, 1.
Part-1-1.SlaveFace13-25, 2, -1.
Part-1-1.MasterNode, 1, -0.1054
** Constraint: Constraint13-2-26
*Equation
Part-1-1.MasterFace13-26, 2, 1.
Part-1-1.SlaveFace13-26, 2, -1.
Part-1-1.MasterNode, 1, -0.1054
** Constraint: Constraint13-2-27
*Equation
Part-1-1.MasterFace13-27, 2, 1.
Part-1-1.SlaveFace13-27, 2, -1.
Part-1-1.MasterNode, 1, -0.1054
** Constraint: Constraint13-2-28
*Equation
Part-1-1.MasterFace13-28, 2, 1.
Part-1-1.SlaveFace13-28, 2, -1.
Part-1-1.MasterNode, 1, -0.1054
** Constraint: Constraint13-2-29
*Equation
Part-1-1.MasterFace13-29, 2, 1.
Part-1-1.SlaveFace13-29, 2, -1.
Part-1-1.MasterNode, 1, -0.1054
** Constraint: Constraint13-2-30
*Equation
Part-1-1.MasterFace13-30, 2, 1.
Part-1-1.SlaveFace13-30, 2, -1.
Part-1-1.MasterNode, 1, -0.1054
** Constraint: Constraint13-2-31
*Equation
Part-1-1.MasterFace13-31, 2, 1.
Part-1-1.SlaveFace13-31, 2, -1.
Part-1-1.MasterNode, 1, -0.1054
** Constraint: Constraint13-2-32
*Equation
Part-1-1.MasterFace13-32, 2, 1.
Part-1-1.SlaveFace13-32, 2, -1.
Part-1-1.MasterNode, 1, -0.1054
** Constraint: Constraint13-2-33
*Equation
Part-1-1.MasterFace13-33, 2, 1.
Part-1-1.SlaveFace13-33, 2, -1.
Part-1-1.MasterNode, 1, -0.1054
** Constraint: Constraint13-2-34
*Equation
Part-1-1.MasterFace13-34, 2, 1.
Part-1-1.SlaveFace13-34, 2, -1.
Part-1-1.MasterNode, 1, -0.1054
** Constraint: Constraint13-2-35
*Equation
Part-1-1.MasterFace13-35, 2, 1.
Part-1-1.SlaveFace13-35, 2, -1.
Part-1-1.MasterNode, 1, -0.1054
** Constraint: Constraint13-2-36
*Equation
Part-1-1.MasterFace13-36, 2, 1.
Part-1-1.SlaveFace13-36, 2, -1.
Part-1-1.MasterNode, 1, -0.1054
** Constraint: Constraint13-2-37
*Equation
Part-1-1.MasterFace13-37, 2, 1.
Part-1-1.SlaveFace13-37, 2, -1.
Part-1-1.MasterNode, 1, -0.1054
** Constraint: Constraint13-2-38
*Equation
Part-1-1.MasterFace13-38, 2, 1.
Part-1-1.SlaveFace13-38, 2, -1.
Part-1-1.MasterNode, 1, -0.1054
** Constraint: Constraint13-2-39
*Equation
Part-1-1.MasterFace13-39, 2, 1.
Part-1-1.SlaveFace13-39, 2, -1.
Part-1-1.MasterNode, 1, -0.1054
** Constraint: Constraint13-2-40
*Equation
Part-1-1.MasterFace13-40, 2, 1.
Part-1-1.SlaveFace13-40, 2, -1.
Part-1-1.MasterNode, 1, -0.1054
** Constraint: Constraint13-2-41
*Equation
Part-1-1.MasterFace13-41, 2, 1.
Part-1-1.SlaveFace13-41, 2, -1.
Part-1-1.MasterNode, 1, -0.1054
** Constraint: Constraint13-2-42
*Equation
Part-1-1.MasterFace13-42, 2, 1.
Part-1-1.SlaveFace13-42, 2, -1.
Part-1-1.MasterNode, 1, -0.1054
** Constraint: Constraint13-2-43
*Equation
Part-1-1.MasterFace13-43, 2, 1.
Part-1-1.SlaveFace13-43, 2, -1.
Part-1-1.MasterNode, 1, -0.1054
** Constraint: Constraint13-2-44
*Equation
Part-1-1.MasterFace13-44, 2, 1.
Part-1-1.SlaveFace13-44, 2, -1.
Part-1-1.MasterNode, 1, -0.1054
** Constraint: Constraint24-1-0
*Equation
Part-1-1.MasterFace24-0, 1, 1.
Part-1-1.SlaveFace24-0, 1, -1.
Part-1-1.MasterNode, 1, -0.18256
** Constraint: Constraint24-1-1
*Equation
Part-1-1.MasterFace24-1, 1, 1.
Part-1-1.SlaveFace24-1, 1, -1.
Part-1-1.MasterNode, 1, -0.18256
** Constraint: Constraint24-1-2
*Equation
Part-1-1.MasterFace24-2, 1, 1.
Part-1-1.SlaveFace24-2, 1, -1.
Part-1-1.MasterNode, 1, -0.18256
** Constraint: Constraint24-1-3
*Equation
Part-1-1.MasterFace24-3, 1, 1.
Part-1-1.SlaveFace24-3, 1, -1.
Part-1-1.MasterNode, 1, -0.18256
** Constraint: Constraint24-1-4
*Equation
Part-1-1.MasterFace24-4, 1, 1.
Part-1-1.SlaveFace24-4, 1, -1.
Part-1-1.MasterNode, 1, -0.18256
** Constraint: Constraint24-1-5
*Equation
Part-1-1.MasterFace24-5, 1, 1.
Part-1-1.SlaveFace24-5, 1, -1.
Part-1-1.MasterNode, 1, -0.18256
** Constraint: Constraint24-1-6
*Equation
Part-1-1.MasterFace24-6, 1, 1.
Part-1-1.SlaveFace24-6, 1, -1.
Part-1-1.MasterNode, 1, -0.18256
** Constraint: Constraint24-1-7
*Equation
Part-1-1.MasterFace24-7, 1, 1.
Part-1-1.SlaveFace24-7, 1, -1.
Part-1-1.MasterNode, 1, -0.18256
** Constraint: Constraint24-1-8
*Equation
Part-1-1.MasterFace24-8, 1, 1.
Part-1-1.SlaveFace24-8, 1, -1.
Part-1-1.MasterNode, 1, -0.18256
** Constraint: Constraint24-1-9
*Equation
Part-1-1.MasterFace24-9, 1, 1.
Part-1-1.SlaveFace24-9, 1, -1.
Part-1-1.MasterNode, 1, -0.18256
** Constraint: Constraint24-1-10
*Equation
Part-1-1.MasterFace24-10, 1, 1.
Part-1-1.SlaveFace24-10, 1, -1.
Part-1-1.MasterNode, 1, -0.18256
** Constraint: Constraint24-1-11
*Equation
Part-1-1.MasterFace24-11, 1, 1.
Part-1-1.SlaveFace24-11, 1, -1.
Part-1-1.MasterNode, 1, -0.18256
** Constraint: Constraint24-1-12
*Equation
Part-1-1.MasterFace24-12, 1, 1.
Part-1-1.SlaveFace24-12, 1, -1.
Part-1-1.MasterNode, 1, -0.18256
** Constraint: Constraint24-1-13
*Equation
Part-1-1.MasterFace24-13, 1, 1.
Part-1-1.SlaveFace24-13, 1, -1.
Part-1-1.MasterNode, 1, -0.18256
** Constraint: Constraint24-1-14
*Equation
Part-1-1.MasterFace24-14, 1, 1.
Part-1-1.SlaveFace24-14, 1, -1.
Part-1-1.MasterNode, 1, -0.18256
** Constraint: Constraint24-1-15
*Equation
Part-1-1.MasterFace24-15, 1, 1.
Part-1-1.SlaveFace24-15, 1, -1.
Part-1-1.MasterNode, 1, -0.18256
** Constraint: Constraint24-1-16
*Equation
Part-1-1.MasterFace24-16, 1, 1.
Part-1-1.SlaveFace24-16, 1, -1.
Part-1-1.MasterNode, 1, -0.18256
** Constraint: Constraint24-1-17
*Equation
Part-1-1.MasterFace24-17, 1, 1.
Part-1-1.SlaveFace24-17, 1, -1.
Part-1-1.MasterNode, 1, -0.18256
** Constraint: Constraint24-1-18
*Equation
Part-1-1.MasterFace24-18, 1, 1.
Part-1-1.SlaveFace24-18, 1, -1.
Part-1-1.MasterNode, 1, -0.18256
** Constraint: Constraint24-1-19
*Equation
Part-1-1.MasterFace24-19, 1, 1.
Part-1-1.SlaveFace24-19, 1, -1.
Part-1-1.MasterNode, 1, -0.18256
** Constraint: Constraint24-1-20
*Equation
Part-1-1.MasterFace24-20, 1, 1.
Part-1-1.SlaveFace24-20, 1, -1.
Part-1-1.MasterNode, 1, -0.18256
** Constraint: Constraint24-1-21
*Equation
Part-1-1.MasterFace24-21, 1, 1.
Part-1-1.SlaveFace24-21, 1, -1.
Part-1-1.MasterNode, 1, -0.18256
** Constraint: Constraint24-1-22
*Equation
Part-1-1.MasterFace24-22, 1, 1.
Part-1-1.SlaveFace24-22, 1, -1.
Part-1-1.MasterNode, 1, -0.18256
** Constraint: Constraint24-1-23
*Equation
Part-1-1.MasterFace24-23, 1, 1.
Part-1-1.SlaveFace24-23, 1, -1.
Part-1-1.MasterNode, 1, -0.18256
** Constraint: Constraint24-1-24
*Equation
Part-1-1.MasterFace24-24, 1, 1.
Part-1-1.SlaveFace24-24, 1, -1.
Part-1-1.MasterNode, 1, -0.18256
** Constraint: Constraint24-2-0
*Equation
Part-1-1.MasterFace24-0, 2, 1.
Part-1-1.SlaveFace24-0, 2, -1.
Part-1-1.MasterNode, 1, -0.
** Constraint: Constraint24-2-1
*Equation
Part-1-1.MasterFace24-1, 2, 1.
Part-1-1.SlaveFace24-1, 2, -1.
Part-1-1.MasterNode, 1, -0.
** Constraint: Constraint24-2-2
*Equation
Part-1-1.MasterFace24-2, 2, 1.
Part-1-1.SlaveFace24-2, 2, -1.
Part-1-1.MasterNode, 1, -0.
** Constraint: Constraint24-2-3
*Equation
Part-1-1.MasterFace24-3, 2, 1.
Part-1-1.SlaveFace24-3, 2, -1.
Part-1-1.MasterNode, 1, -0.
** Constraint: Constraint24-2-4
*Equation
Part-1-1.MasterFace24-4, 2, 1.
Part-1-1.SlaveFace24-4, 2, -1.
Part-1-1.MasterNode, 1, -0.
** Constraint: Constraint24-2-5
*Equation
Part-1-1.MasterFace24-5, 2, 1.
Part-1-1.SlaveFace24-5, 2, -1.
Part-1-1.MasterNode, 1, -0.
** Constraint: Constraint24-2-6
*Equation
Part-1-1.MasterFace24-6, 2, 1.
Part-1-1.SlaveFace24-6, 2, -1.
Part-1-1.MasterNode, 1, -0.
** Constraint: Constraint24-2-7
*Equation
Part-1-1.MasterFace24-7, 2, 1.
Part-1-1.SlaveFace24-7, 2, -1.
Part-1-1.MasterNode, 1, -0.
** Constraint: Constraint24-2-8
*Equation
Part-1-1.MasterFace24-8, 2, 1.
Part-1-1.SlaveFace24-8, 2, -1.
Part-1-1.MasterNode, 1, -0.
** Constraint: Constraint24-2-9
*Equation
Part-1-1.MasterFace24-9, 2, 1.
Part-1-1.SlaveFace24-9, 2, -1.
Part-1-1.MasterNode, 1, -0.
** Constraint: Constraint24-2-10
*Equation
Part-1-1.MasterFace24-10, 2, 1.
Part-1-1.SlaveFace24-10, 2, -1.
Part-1-1.MasterNode, 1, -0.
** Constraint: Constraint24-2-11
*Equation
Part-1-1.MasterFace24-11, 2, 1.
Part-1-1.SlaveFace24-11, 2, -1.
Part-1-1.MasterNode, 1, -0.
** Constraint: Constraint24-2-12
*Equation
Part-1-1.MasterFace24-12, 2, 1.
Part-1-1.SlaveFace24-12, 2, -1.
Part-1-1.MasterNode, 1, -0.
** Constraint: Constraint24-2-13
*Equation
Part-1-1.MasterFace24-13, 2, 1.
Part-1-1.SlaveFace24-13, 2, -1.
Part-1-1.MasterNode, 1, -0.
** Constraint: Constraint24-2-14
*Equation
Part-1-1.MasterFace24-14, 2, 1.
Part-1-1.SlaveFace24-14, 2, -1.
Part-1-1.MasterNode, 1, -0.
** Constraint: Constraint24-2-15
*Equation
Part-1-1.MasterFace24-15, 2, 1.
Part-1-1.SlaveFace24-15, 2, -1.
Part-1-1.MasterNode, 1, -0.
** Constraint: Constraint24-2-16
*Equation
Part-1-1.MasterFace24-16, 2, 1.
Part-1-1.SlaveFace24-16, 2, -1.
Part-1-1.MasterNode, 1, -0.
** Constraint: Constraint24-2-17
*Equation
Part-1-1.MasterFace24-17, 2, 1.
Part-1-1.SlaveFace24-17, 2, -1.
Part-1-1.MasterNode, 1, -0.
** Constraint: Constraint24-2-18
*Equation
Part-1-1.MasterFace24-18, 2, 1.
Part-1-1.SlaveFace24-18, 2, -1.
Part-1-1.MasterNode, 1, -0.
** Constraint: Constraint24-2-19
*Equation
Part-1-1.MasterFace24-19, 2, 1.
Part-1-1.SlaveFace24-19, 2, -1.
Part-1-1.MasterNode, 1, -0.
** Constraint: Constraint24-2-20
*Equation
Part-1-1.MasterFace24-20, 2, 1.
Part-1-1.SlaveFace24-20, 2, -1.
Part-1-1.MasterNode, 1, -0.
** Constraint: Constraint24-2-21
*Equation
Part-1-1.MasterFace24-21, 2, 1.
Part-1-1.SlaveFace24-21, 2, -1.
Part-1-1.MasterNode, 1, -0.
** Constraint: Constraint24-2-22
*Equation
Part-1-1.MasterFace24-22, 2, 1.
Part-1-1.SlaveFace24-22, 2, -1.
Part-1-1.MasterNode, 1, -0.
** Constraint: Constraint24-2-23
*Equation
Part-1-1.MasterFace24-23, 2, 1.
Part-1-1.SlaveFace24-23, 2, -1.
Part-1-1.MasterNode, 1, -0.
** Constraint: Constraint24-2-24
*Equation
Part-1-1.MasterFace24-24, 2, 1.
Part-1-1.SlaveFace24-24, 2, -1.
Part-1-1.MasterNode, 1, -0.
** Constraint: ConstraintV1-V3-1
*Equation
Part-1-1.Vertex1, 1, 1.
Part-1-1.Vertex3, 1, -1.
Part-1-1.MasterNode, 1, -0.18256
** Constraint: ConstraintV1-V3-2
*Equation
Part-1-1.Vertex1, 2, 1.
Part-1-1.Vertex3, 2, -1.
Part-1-1.MasterNode, 1, -0.1054
** Constraint: ConstraintV2-V4-1
*Equation
Part-1-1.Vertex2, 1, 1.
Part-1-1.Vertex4, 1, -1.
Part-1-1.MasterNode, 1, -0.18256
** Constraint: ConstraintV2-V4-2
*Equation
Part-1-1.Vertex2, 2, 1.
Part-1-1.Vertex4, 2, -1.
Part-1-1.MasterNode, 1, 0.1054
*End Assembly
**
** MATERIALS
**
*Material, name=fiber
*Elastic
 0.1684, 0.443
*Material, name=matrix
*Elastic, moduli=INSTANTANEOUS
 0.004082, 0.311
*Viscoelastic, time=PRONY
 0.999, 0.999, 39.15
** ----------------------------------------------------------------
**
** STEP: Step-1
**
*Step, name=Step-1, nlgeom=NO
*Visco, cetol=1e-06
0.001, 0.001, 1e-08, 0.001
**
** BOUNDARY CONDITIONS
**
** Name: BC-1 Type: Displacement/Rotation
*Boundary
_PickedSet4, 1, 1, 1.
**
** OUTPUT REQUESTS
**
*Restart, write, frequency=0
**
** FIELD OUTPUT: F-Output-1
**
*Output, field
*Node Output
CF, RF, U
*Element Output, directions=YES
IVOL, LE, S, STH
**
** HISTORY OUTPUT: H-Output-1
**
*Output, history, variable=PRESELECT
*End Step
** ----------------------------------------------------------------
**
** STEP: Step-2
**
*Step, name=Step-2, nlgeom=NO, inc=200
*Visco
1., 100.,
**
** OUTPUT REQUESTS
**
*Restart, write, frequency=0
**
** FIELD OUTPUT: F-Output-1
**
*Output, field
*Node Output
CF, RF, U
*Element Output, directions=YES
IVOL, LE, S, STH
**
** HISTORY OUTPUT: H-Output-1
**
*Output, history, variable=PRESELECT
*End Step