*Heading
** Job name: Job-Ex-3-13 Model name: Model-1
** Generated by: Abaqus/CAE 2020
*Preprint, echo=NO, model=YES, history=NO, contact=NO
**
** PARTS
**
*Part, name=Part-1
*End Part
**
**
** ASSEMBLY
**
*Assembly, name=Assembly
**
*Instance, name=Part-1-1, part=Part-1
*Node
*Element, type=S8R5
*Nset, nset=_PickedSet2, internal, generate
*Elset, elset=_PickedSet2, internal, generate
*Orientation, name=Ori-1
** Section: Section-1
*Shell Section, elset=_PickedSet2, material=unidirectional-user, orientation=Ori-1
10., 3
*Transverse Shear Stiffness
35883., 23000., 0.
*End Instance
**
*Nset, nset=_PickedSet11, internal, instance=Part-1-1
*Elset, elset=_PickedSet11, internal, instance=Part-1-1
*Nset, nset=_PickedSet12, internal, instance=Part-1-1
*Elset, elset=_PickedSet12, internal, instance=Part-1-1
*Elset, elset=__PickedSurf4_SPOS, internal, instance=Part-1-1, generate
*Surface, type=ELEMENT, name=_PickedSurf4, internal
__PickedSurf4_SPOS, SPOS
*End Assembly
**
** MATERIALS
**
*Material, name=unidirectional
*Elastic, type=LAMINA
133860., 7706., 0.301, 4306., 4306., 2760.
*Fail Stress
*Material, name=unidirectional-user
*Depvar
*User Material, constants=11
**
** BOUNDARY CONDITIONS
**
** Name: BC-1 Type: Displacement/Rotation
*Boundary
_PickedSet11, 2, 2
_PickedSet11, 3, 3
_PickedSet11, 4, 4
** Name: BC-2 Type: Displacement/Rotation
*Boundary
_PickedSet12, 1, 1
_PickedSet12, 3, 3
_PickedSet12, 5, 5
** ----------------------------------------------------------------
**
** STEP: Step-1
**
*Step, name=Step-1, nlgeom=NO
*Static
1., 1., 1e-05, 1.
**
** LOADS
**
** Name: Load-1   Type: Pressure
*Dsload
_PickedSurf4, P, 0.0012
**
** OUTPUT REQUESTS
**
*Restart, write, frequency=0
*Print, solve=NO
**
** FIELD OUTPUT: F-Output-1
**
*Output, field
*Node Output
RF, U
*Element Output, directions=YES
CFAILURE, LE, S, SDV
**
** HISTORY OUTPUT: H-Output-1
**
*Output, history, variable=PRESELECT
*End Step